BDBM50274738 CHEMBL4128313
SMILES Cc1cc(O)cc(C)c1C[C@H](N)C(=O)N[C@H](CCCNC(N)=N)C(=O)N[C@@H](Cc1cccc(c1)-c1ccsc1)C(=O)NCC(N)=O
InChI Key InChIKey=WTHOGRCQTCKRIC-VJGNERBWSA-N
Data  3 IC50
  Tab Delimited (TSV)   2D SDfile   Computed 3D by Vconf -m prep SDfile
Find this compound or compounds like it in BindingDB:
Activity Spreadsheet -- Enzyme Inhibition Constant Data from BindingDB
Found 1 hit for monomerid = 50274738
TargetDelta-type opioid receptor(MOUSE)
Vrije Universiteit Brussel
Curated by ChEMBL
LigandPNGBDBM50274738(CHEMBL4128313)
Affinity DataIC50:  601nM. Assay description: Tested for thromboxane antagonist potency (pA2) against U 44619 induced platelet aggregation using human platelet rich plasma
In DepthDetails ArticlePubMed